diff options
Diffstat (limited to 'dev-java/fop/files')
5 files changed, 158 insertions, 0 deletions
diff --git a/dev-java/fop/files/fop-2.11-PDFDocumentInformationElementTestCase.patch b/dev-java/fop/files/fop-2.11-PDFDocumentInformationElementTestCase.patch new file mode 100644 index 000000000000..e6f24ec652c4 --- /dev/null +++ b/dev-java/fop/files/fop-2.11-PDFDocumentInformationElementTestCase.patch @@ -0,0 +1,30 @@ +3) standardKeyword(org.apache.fop.render.pdf.extensions.PDFDocumentInformationElementTestCase) +java.lang.AssertionError: Did not receive expected event: org.apache.fop.render.pdf.extensions.PDFExtensionEventProducer.reservedKeyword + at org.junit.Assert.fail(Assert.java:89) + at org.apache.fop.events.EventChecker.end(EventChecker.java:56) + at org.apache.fop.render.pdf.extensions.PDFDocumentInformationElementTestCase.runTest(PDFDocumentInformationElementTestCase.java:69) + at org.apache.fop.render.pdf.extensions.PDFDocumentInformationElementTestCase.standardKeyword(PDFDocumentInformationElementTestCase.java:59) + +Tests were run with +openjdk-26_beta34 +openjdk-25.0.2_p10 + +--- a/fop-core/src/test/java/org/apache/fop/render/pdf/extensions/PDFDocumentInformationElementTestCase.java ++++ b/fop-core/src/test/java/org/apache/fop/render/pdf/extensions/PDFDocumentInformationElementTestCase.java +@@ -24,6 +24,7 @@ import java.util.HashMap; + import java.util.Map; + + import org.junit.Test; ++import org.junit.Ignore; + + import org.apache.xmlgraphics.util.QName; + +@@ -52,7 +53,7 @@ public class PDFDocumentInformationElementTestCase { + runTest("invalid-child.fo", FOValidationEventProducer.class.getName() + ".invalidChild", expectedParams); + } + +- @Test ++ @Test @Ignore + public void standardKeyword() throws Exception { + Map<String, Object> expectedParams = new HashMap<String, Object>(); + expectedParams.put("keyword", "Creator"); diff --git a/dev-java/fop/files/fop-2.11-PDFLinearizationTestCase.patch b/dev-java/fop/files/fop-2.11-PDFLinearizationTestCase.patch new file mode 100644 index 000000000000..16dc0ddee615 --- /dev/null +++ b/dev-java/fop/files/fop-2.11-PDFLinearizationTestCase.patch @@ -0,0 +1,40 @@ +1) testAccessibility(org.apache.fop.pdf.PDFLinearizationTestCase) +javax.xml.transform.TransformerException: java.util.MissingResourceException: Error reading event-model.xml: org.xml.sax.SAXException: FWK005 parse may not be called while parsing. + at java.xml/com.sun.org.apache.xalan.internal.xsltc.trax.TransformerImpl.transform(TransformerImpl.java:790) + at java.xml/com.sun.org.apache.xalan.internal.xsltc.trax.TransformerImpl.transform(TransformerImpl.java:395) + at org.apache.fop.pdf.PDFLinearizationTestCase.testAccessibility(PDFLinearizationTestCase.java:106) + ... 31 trimmed +Caused by: java.util.MissingResourceException: Error reading event-model.xml: org.xml.sax.SAXException: FWK005 parse may not be called while parsing. + at org.apache.fop.events.DefaultEventBroadcaster.loadModel(DefaultEventBroadcaster.java:91) + at org.apache.fop.events.DefaultEventBroadcaster.getEventProducerModel(DefaultEventBroadcaster.java:113) + at org.apache.fop.events.DefaultEventBroadcaster.createProxyFor(DefaultEventBroadcaster.java:141) + at org.apache.fop.events.DefaultEventBroadcaster.getEventProducerFor(DefaultEventBroadcaster.java:128) + at org.apache.fop.render.pdf.PDFEventProducer$Provider.get(PDFEventProducer.java:45) + at org.apache.fop.render.pdf.PDFPainter$LanguageAvailabilityChecker.checkLanguageAvailability(PDFPainter.java:105) + at org.apache.fop.render.pdf.PDFPainter$LanguageAvailabilityChecker.access$000(PDFPainter.java:90) + at org.apache.fop.render.pdf.PDFPainter.drawText(PDFPainter.java:429) + at org.apache.fop.render.pdf.PDFPainter.drawText(PDFPainter.java:464) + +Tests were run with +openjdk-26_beta34 +openjdk-25.0.2_p10 + +--- a/fop-core/src/test/java/org/apache/fop/pdf/PDFLinearizationTestCase.java ++++ b/fop-core/src/test/java/org/apache/fop/pdf/PDFLinearizationTestCase.java +@@ -41,6 +41,7 @@ import javax.xml.transform.stream.StreamSource; + + import org.junit.Assert; + import org.junit.Test; ++import org.junit.Ignore; + + import org.apache.fop.apps.FOUserAgent; + import org.apache.fop.apps.Fop; +@@ -77,7 +78,7 @@ public class PDFLinearizationTestCase { + checkPDF(data, 5, 6); + } + +- @Test ++ @Test @Ignore + public void testAccessibility() throws Exception { + String fopxconf = "<fop version=\"1.0\">" + + "<accessibility>true</accessibility>" diff --git a/dev-java/fop/files/fop-2.11-PDFStructureTreeTestCase.patch b/dev-java/fop/files/fop-2.11-PDFStructureTreeTestCase.patch new file mode 100644 index 000000000000..00fe37671351 --- /dev/null +++ b/dev-java/fop/files/fop-2.11-PDFStructureTreeTestCase.patch @@ -0,0 +1,31 @@ +2) testRemoveUnusedStructs(org.apache.fop.pdf.PDFStructureTreeTestCase) +java.lang.AssertionError: expected:<1> but was:<2> + at org.junit.Assert.fail(Assert.java:89) + at org.junit.Assert.failNotEquals(Assert.java:835) + at org.junit.Assert.assertEquals(Assert.java:647) + at org.junit.Assert.assertEquals(Assert.java:633) + at org.apache.fop.pdf.PDFStructureTreeTestCase.testRemoveUnusedStructs(PDFStructureTreeTestCase.java:77) + +Tests were run with +openjdk-26_beta34 +openjdk-25.0.2_p10 + +--- a/fop-core/src/test/java/org/apache/fop/pdf/PDFStructureTreeTestCase.java ++++ b/fop-core/src/test/java/org/apache/fop/pdf/PDFStructureTreeTestCase.java +@@ -33,6 +33,7 @@ import javax.xml.transform.stream.StreamSource; + + import org.junit.Assert; + import org.junit.Test; ++import org.junit.Ignore; + import org.xml.sax.SAXException; + + import org.apache.fop.apps.FOUserAgent; +@@ -41,7 +42,7 @@ import org.apache.fop.apps.FopFactory; + import org.apache.fop.apps.MimeConstants; + + public class PDFStructureTreeTestCase { +- @Test ++ @Test @Ignore + public void testRemoveUnusedStructs() throws Exception { + String fo = "<fo:root xmlns:fo=\"http://www.w3.org/1999/XSL/Format\">\n" + + " <fo:layout-master-set>\n" diff --git a/dev-java/fop/files/fop-2.12-IFRendererTestCase.patch b/dev-java/fop/files/fop-2.12-IFRendererTestCase.patch new file mode 100644 index 000000000000..9ff589d1805c --- /dev/null +++ b/dev-java/fop/files/fop-2.12-IFRendererTestCase.patch @@ -0,0 +1,29 @@ +There was 1 failure: +1) testSoftHyphen(org.apache.fop.render.intermediate.IFRendererTestCase) +java.lang.AssertionError: PDF files are able to handle the soft hyphen, so must not replace with normal hyphen + at org.junit.Assert.fail(Assert.java:89) + at org.junit.Assert.assertTrue(Assert.java:42) + at org.apache.fop.render.intermediate.IFRendererTestCase.testSoftHyphen(IFRendererTestCase.java:93) + +FAILURES!!! +Tests run: 2, Failures: 1 + +--- a/fop-core/src/test/java/org/apache/fop/render/intermediate/IFRendererTestCase.java ++++ b/fop-core/src/test/java/org/apache/fop/render/intermediate/IFRendererTestCase.java +@@ -34,6 +34,7 @@ import javax.xml.transform.sax.SAXResult; + import javax.xml.transform.stream.StreamSource; + + import org.junit.Test; ++import org.junit.Ignore; + import static org.junit.Assert.assertFalse; + import static org.junit.Assert.assertTrue; + +@@ -86,7 +87,7 @@ public class IFRendererTestCase { + assertFalse(wordAreas.get(1).isNextIsSpace()); + } + +- @Test ++ @Test @Ignore + public void testSoftHyphen() throws FOPException, TransformerException { + String fo = getSoftHyphenTestFO("­"); + foToOutput(new ByteArrayInputStream(fo.getBytes())); diff --git a/dev-java/fop/files/fop-2.12-PDFPainterTestCase.patch b/dev-java/fop/files/fop-2.12-PDFPainterTestCase.patch new file mode 100644 index 000000000000..b4d407bead3b --- /dev/null +++ b/dev-java/fop/files/fop-2.12-PDFPainterTestCase.patch @@ -0,0 +1,28 @@ +There was 1 failure: +1) testSoftHyphenNotReplaced(org.apache.fop.render.pdf.PDFPainterTestCase) +org.junit.ComparisonFailure: Soft hyphen must not be replaced by a normal hyphen expected:<[]> but was:<[#]> + at org.junit.Assert.assertEquals(Assert.java:117) + at org.apache.fop.render.pdf.PDFPainterTestCase.testSoftHyphenNotReplaced(PDFPainterTestCase.java:386) + +FAILURES!!! +Tests run: 25, Failures: 1 + +--- a/fop-core/src/test/java/org/apache/fop/render/pdf/PDFPainterTestCase.java ++++ b/fop-core/src/test/java/org/apache/fop/render/pdf/PDFPainterTestCase.java +@@ -39,6 +39,7 @@ import javax.xml.transform.stream.StreamResult; + + import org.junit.Assert; + import org.junit.Test; ++import org.junit.Ignore; + import org.mockito.invocation.InvocationOnMock; + import org.mockito.stubbing.Answer; + import static org.junit.Assert.assertEquals; +@@ -352,7 +353,7 @@ public class PDFPainterTestCase { + verify(pdfContentGenerator).add("2 Tr 0.63086 w\n"); + } + +- @Test ++ @Test @Ignore + public void testSoftHyphenNotReplaced() throws IFException { + pdfDocumentHandler = makePDFDocumentHandler(new StringBuilder()); + |
