diff options
Diffstat (limited to 'dev-java')
22 files changed, 2 insertions, 721 deletions
diff --git a/dev-java/commons-text/commons-text-1.10.0.ebuild b/dev-java/commons-text/commons-text-1.10.0.ebuild index 49f9e33ed28d..3a297ceebf2d 100644 --- a/dev-java/commons-text/commons-text-1.10.0.ebuild +++ b/dev-java/commons-text/commons-text-1.10.0.ebuild @@ -17,7 +17,7 @@ SRC_URI="mirror://apache//commons/text/source/commons-text-${PV}-src.tar.gz" LICENSE="Apache-2.0" SLOT="0" -KEYWORDS="~amd64 ~ppc64 ~x86" +KEYWORDS="~amd64 ppc64 ~x86" # Common dependencies # POM: pom.xml diff --git a/dev-java/gson/Manifest b/dev-java/gson/Manifest index 52ad44456dd4..d07656879069 100644 --- a/dev-java/gson/Manifest +++ b/dev-java/gson/Manifest @@ -1,2 +1 @@ -DIST gson-2.9.0.tar.gz 350309 BLAKE2B f17f7a7410744b14cb79c979b35c7f3c46a3d9e922722c41893b872013319a1bd06d81526e8380055aafa47524bfcc50e02629d1c5994e1f9f81df4391a9c651 SHA512 25e57f0e3cbff7e4d33070d250ba4ecf1c659380bce07863c52a3b30edd0ba88c923e55b0f38098b5ce3827a74a21c4d41f9de02f6a84da771ae39fd823667d3 DIST gson-parent-2.9.1.tar.gz 359012 BLAKE2B e0a0d6e517e7323a508d7aa6cb26e39aad4a3c479b479ae7b075d3cb47c0312294eb074ed52f1fbbec5de301341dac7f5d742913498205f0544a53da0c0eb1a1 SHA512 928a17491efc9866271f08d4ec0fc22b96b4b6f4827d86679cd4a9085e91fbf6b1b4d6618d380ff63e7a9922d9cf0ec7ba9cd073862e7e212eb31c0140c6b6ad diff --git a/dev-java/gson/gson-2.9.0-r2.ebuild b/dev-java/gson/gson-2.9.0-r2.ebuild deleted file mode 100644 index 19d4e18df7d0..000000000000 --- a/dev-java/gson/gson-2.9.0-r2.ebuild +++ /dev/null @@ -1,60 +0,0 @@ -# Copyright 1999-2022 Gentoo Authors -# Distributed under the terms of the GNU General Public License v2 - -# Skeleton command: -# java-ebuilder --generate-ebuild --workdir . --pom pom.xml --download-uri https://github.com/google/gson/archive/gson-parent-2.9.0.tar.gz --slot 2.6 --keywords "~amd64 ~arm ~arm64 ~ppc64 ~x86" --ebuild gson-2.9.0.ebuild - -EAPI=8 - -JAVA_PKG_IUSE="doc source test" -MAVEN_ID="com.google.code.gson:gson:2.9.0" -JAVA_TESTING_FRAMEWORKS="junit-4" - -inherit java-pkg-2 java-pkg-simple - -DESCRIPTION="Gson JSON library" -HOMEPAGE="https://github.com/google/gson" -SRC_URI="https://github.com/google/${PN}/archive/${PN}-parent-${PV}.tar.gz -> ${P}.tar.gz" - -LICENSE="Apache-2.0" -SLOT="2.6" -KEYWORDS="amd64 ~arm arm64 ppc64 x86" - -DEPEND=">=virtual/jdk-11:*" -RDEPEND=">=virtual/jre-1.8:*" - -S="${WORKDIR}/${PN}-${PN}-parent-${PV}/${PN}" - -JAVA_SRC_DIR=( - "src/main/java" - "src/main/java-templates" -) - -JAVA_TEST_GENTOO_CLASSPATH="junit-4" -JAVA_TEST_SRC_DIR="src/test/java" -JAVA_TEST_RESOURCE_DIRS="src/test/resources" - -JAVA_TEST_EXCLUDES=( - # requires the test class to be obfuscated using proguard which we do not have atm - "com.google.gson.functional.EnumWithObfuscatedTest" - # FAILURES!!! - # Tests run: 1090, Failures: 3 - # testComGoogleGsonAnnotationsPackage(com.google.gson.regression.OSGiTest) - # junit.framework.AssertionFailedError: Cannot find com.google.gson OSGi bundle manifest - "com.google.gson.regression.OSGiTest" - # testSerializeInternalImplementationObject(com.google.gson.functional.ReflectionAccessTest) - # java.lang.IllegalStateException: Expected BEGIN_ARRAY but was BEGIN_OBJECT at line 1 column 2 path $ - "com.google.gson.functional.ReflectionAccessTest" -) - -src_prepare() { - default - sed -e "s/\${project.version}/${PV}/g" \ - -i src/main/java-templates/com/google/gson/internal/GsonBuildConfig.java \ - || die "Failed to set version" - - local vm_version="$(java-config -g PROVIDES_VERSION)" - if ver_test "${vm_version}" -ge "17" ; then - JAVA_TEST_EXCLUDES+=( "com.google.gson.internal.bind.DefaultDateTypeAdapterTest" ) - fi -} diff --git a/dev-java/jackson-annotations/Manifest b/dev-java/jackson-annotations/Manifest index 72572870ca8c..e56fa64c2593 100644 --- a/dev-java/jackson-annotations/Manifest +++ b/dev-java/jackson-annotations/Manifest @@ -1,2 +1 @@ -DIST jackson-annotations-2.13.3.tar.gz 1984205 BLAKE2B c577fcdcb40c44cf1cb08ebe467318ca4e4fff9fdeaf756360ef202275a48b5f5a93135439567261651b5731f523588f0c29a17c05ba6d03fec0f19ed19d9c5b SHA512 c00aec542c8ddea999fb60536cb2cab3edbf4f1d20b29e404d62add54a22546ca195ab7faeda4a2cd1d3a827f10420ccafe1dfb0065742f46aecfc2d00f2c1fc DIST jackson-annotations-2.13.4.tar.gz 1984001 BLAKE2B 8c4eed89fc0c5b3d68f25f2db28a38e55a2e629c7c38289a82f4ff4a122967326e0221cb020afb69577fe4d5baa2ba89f8db5a398302cd25404083a5d0830eaf SHA512 5ad1d07b254956f9d4123eb01e32d8a8f43eccefe60c6841675ccfecd8837feb4de9352d90f8b8a2703f0f12a0fd20083f8d274594e1ca5674894b2cd76ce322 diff --git a/dev-java/jackson-annotations/jackson-annotations-2.13.3.ebuild b/dev-java/jackson-annotations/jackson-annotations-2.13.3.ebuild deleted file mode 100644 index 13397eeb87c4..000000000000 --- a/dev-java/jackson-annotations/jackson-annotations-2.13.3.ebuild +++ /dev/null @@ -1,43 +0,0 @@ -# Copyright 1999-2022 Gentoo Authors -# Distributed under the terms of the GNU General Public License v2 - -# Skeleton command: -# java-ebuilder --generate-ebuild --workdir . --pom pom.xml --download-uri https://github.com/FasterXML/jackson-annotations/archive/jackson-annotations-2.13.3.tar.gz --slot 2 --keywords "~amd64 ~arm ~arm64 ~ppc64 ~x86" --ebuild jackson-annotations-2.13.3.ebuild - -EAPI=8 - -JAVA_PKG_IUSE="doc source test" -MAVEN_ID="com.fasterxml.jackson.core:jackson-annotations:2.13.3" -JAVA_TESTING_FRAMEWORKS="junit-4" - -inherit java-pkg-2 java-pkg-simple - -DESCRIPTION="Core annotations used for value types, used by Jackson data binding package." -HOMEPAGE="https://github.com/FasterXML/jackson-annotations" -SRC_URI="https://github.com/FasterXML/${PN}/archive/${P}.tar.gz" - -LICENSE="Apache-2.0" -SLOT="2" -KEYWORDS="amd64 ~arm arm64 ppc64 x86" - -DEPEND=">=virtual/jdk-11:*" -RDEPEND=">=virtual/jre-1.8:*" - -DOCS=( README.md release-notes/VERSION-2.x ) - -S="${WORKDIR}/${PN}-${P}" - -JAVA_SRC_DIR=( "src/main/java" "src/moditect" ) - -JAVA_TEST_GENTOO_CLASSPATH="junit-4" -JAVA_TEST_SRC_DIR="src/test/java" -JAVA_TEST_EXCLUDES=( - # 1) warning(junit.framework.TestSuite$1) - # junit.framework.AssertionFailedError: No tests found in com.fasterxml.jackson.annotation.TestBase - com.fasterxml.jackson.annotation.TestBase -) - -src_install() { - default # https://bugs.gentoo.org/789582 - java-pkg-simple_src_install -} diff --git a/dev-java/jackson-core/Manifest b/dev-java/jackson-core/Manifest index 648bc2c14460..ebe2f5072775 100644 --- a/dev-java/jackson-core/Manifest +++ b/dev-java/jackson-core/Manifest @@ -1,2 +1 @@ -DIST jackson-core-2.13.3.tar.gz 12268319 BLAKE2B 8053988b060cd625670c643d9ba12d9ceae72dffa583bfc78e87044ac723c78bc44dfbdbaca0331098116a43b273dac844721a9e44ba1a536cc457f841d89b56 SHA512 9e7a9ec54073fa6faac36914c496df38bb6c201a37ade2b32306561b71e1b78a0ec4f48b006d4fb10cbde21979a16d117706b59338ada7aedcb593ba5c31ea52 DIST jackson-core-2.13.4.tar.gz 12270995 BLAKE2B d4556ad35eaf4f3182cb07eb39b14691a0d9c5d7801a4f6450536fcb33c19e9d6f24e80477c09dae167d4ff3b3e57798d63f4c24ca689a902350a6ff4ce0b19d SHA512 95fba755c9289728ce6168e57ef8f2417df03616b5839beacc338947d1447719e930b6f820144c0f398f162676e5d56a6a5bbcb86cbdb15f80de566ba45c478a diff --git a/dev-java/jackson-core/jackson-core-2.13.3.ebuild b/dev-java/jackson-core/jackson-core-2.13.3.ebuild deleted file mode 100644 index e25ceed85a1a..000000000000 --- a/dev-java/jackson-core/jackson-core-2.13.3.ebuild +++ /dev/null @@ -1,69 +0,0 @@ -# Copyright 1999-2022 Gentoo Authors -# Distributed under the terms of the GNU General Public License v2 - -# Skeleton command: -# java-ebuilder --generate-ebuild --workdir . --pom pom.xml --download-uri https://github.com/FasterXML/jackson-core/archive/jackson-core-2.13..tar.gz --slot 0 --keywords "~amd64 ~arm ~arm64 ~ppc64 ~x86" --ebuild jackson-core-2.13.333.ebuild - -EAPI=8 - -JAVA_PKG_IUSE="doc source test" -MAVEN_ID="com.fasterxml.jackson.core:jackson-core:2.13.3" -JAVA_TESTING_FRAMEWORKS="junit-4" - -inherit java-pkg-2 java-pkg-simple - -DESCRIPTION="Core Jackson processing abstractions (Streaming API), implementation for JSON" -HOMEPAGE="https://github.com/FasterXML/jackson-core" -SRC_URI="https://github.com/FasterXML/${PN}/archive/${P}.tar.gz" - -LICENSE="Apache-2.0" -SLOT="0" -KEYWORDS="amd64 ~arm arm64 ppc64 x86" - -DEPEND=">=virtual/jdk-11:*" -RDEPEND=">=virtual/jre-1.8:*" - -DOCS=( README.md release-notes/{CREDITS-2.x,VERSION-2.x} ) - -S="${WORKDIR}/${PN}-${P}" - -JAVA_SRC_DIR=( "src/main/java" "src/moditect" ) -JAVA_RESOURCE_DIRS="src/main/resources" - -JAVA_TEST_GENTOO_CLASSPATH="junit-4" -JAVA_TEST_SRC_DIR="src/test/java" -JAVA_TEST_RESOURCE_DIRS="src/test/resources" - -src_prepare() { - default - - sed -e 's:@package@:com.fasterxml.jackson.core.json:g' \ - -e "s:@projectversion@:${PV}:g" \ - -e 's:@projectgroupid@:com.fasterxml.jackson.core:g' \ - -e 's:@projectartifactid@:jackson-core:g' \ - "${JAVA_SRC_DIR}/com/fasterxml/jackson/core/json/PackageVersion.java.in" \ - > "${JAVA_SRC_DIR}/com/fasterxml/jackson/core/json/PackageVersion.java" || die - - java-pkg-2_src_prepare -} - -src_test() { - pushd src/test/java || die - local JAVA_TEST_RUN_ONLY=$(find * -name "*Test*.java" \ - ! -wholename "**/failing**/*.java" \ - ! -wholename "**/testsupport**/*.java" \ - ! -wholename "perf**/*.java" \ - ! -name "*TestBase.java" \ - ! -name "*BaseTest.java" \ - ) - popd - - JAVA_TEST_RUN_ONLY="${JAVA_TEST_RUN_ONLY//.java}" - JAVA_TEST_RUN_ONLY="${JAVA_TEST_RUN_ONLY//\//.}" - java-pkg-simple_src_test -} - -src_install() { - default # https://bugs.gentoo.org/789582 - java-pkg-simple_src_install -} diff --git a/dev-java/jackson-databind/Manifest b/dev-java/jackson-databind/Manifest index e51018c3ba49..34113ea0eb6d 100644 --- a/dev-java/jackson-databind/Manifest +++ b/dev-java/jackson-databind/Manifest @@ -1,2 +1 @@ -DIST jackson-databind-2.13.3.tar.gz 48056095 BLAKE2B 04751cd99eae3bbf3c3a30993506f05b47a85782f52e2cf51f50de9bcb5e9c3718d6ba6105667226272d644dcac6aeeb3ce06dc7ae737adf0392a7a7eafef2aa SHA512 785db6cab20ee74ff90815b8a1afedcbf10f13f60c336a61c20513757cbcde80c073d5f4dc60d390a72600a2b5719cca22b4c71220707dd4edd67dd87f6a7ac9 DIST jackson-databind-2.13.4.1.tar.gz 48063423 BLAKE2B 88370810068f3c1b3973f310e55e6fb53067ff9796de960d2c57cd50ee59dd552f58b4e73d4455076b18ec996ce7714ab84000a4887a1779fcf259859c891346 SHA512 22b7a4225903a0fad3d7d17a5fad79905da96a4a7ebf70b7d9f2c778e88f8c9c2a27d96f66beae96f189ebcd9ca19fd7b12405009ae38023ec8b0511e1ba1af2 diff --git a/dev-java/jackson-databind/jackson-databind-2.13.3.ebuild b/dev-java/jackson-databind/jackson-databind-2.13.3.ebuild deleted file mode 100644 index f6673fd7ebe7..000000000000 --- a/dev-java/jackson-databind/jackson-databind-2.13.3.ebuild +++ /dev/null @@ -1,83 +0,0 @@ -# Copyright 1999-2022 Gentoo Authors -# Distributed under the terms of the GNU General Public License v2 - -# Skeleton command: -# java-ebuilder --generate-ebuild --workdir . --pom pom.xml --download-uri https://github.com/FasterXML/jackson-databind/archive/jackson-databind-2.13.3.tar.gz --slot 0 --keywords "~amd64 ~arm ~arm64 ~ppc64 ~x86" --ebuild jackson-databind-2.13.3.ebuild - -EAPI=8 - -JAVA_PKG_IUSE="doc source test" -MAVEN_ID="com.fasterxml.jackson.core:jackson-databind:2.13.3" -JAVA_TESTING_FRAMEWORKS="junit-4" - -inherit java-pkg-2 java-pkg-simple - -DESCRIPTION="General data-binding functionality for Jackson: works on core streaming API" -HOMEPAGE="https://github.com/FasterXML/jackson-databind" -SRC_URI="https://github.com/FasterXML/${PN}/archive/${P}.tar.gz" - -LICENSE="Apache-2.0" -SLOT="0" -KEYWORDS="amd64 ~arm arm64 ppc64 x86" - -# Dependencies like powermock-{core,module-junit4,api-mockito2} are not available in ::gentoo -RESTRICT="test" - -# Common dependencies -# POM: pom.xml -# com.fasterxml.jackson.core:jackson-annotations:2.13.3 -> >=dev-java/jackson-annotations-2.13.3:2 -# com.fasterxml.jackson.core:jackson-core:2.13.3 -> >=dev-java/jackson-core-2.13.3:0 - -CP_DEPEND=" - ~dev-java/jackson-annotations-${PV}:2 - ~dev-java/jackson-core-${PV}:0 -" - -# Compile dependencies -# POM: pom.xml -# test? javax.measure:jsr-275:0.9.1 -> !!!groupId-not-found!!! -# test? junit:junit:4.13.1 -> >=dev-java/junit-4.13.2:4 -# test? org.powermock:powermock-api-mockito2:2.0.0 -> !!!groupId-not-found!!! -# test? org.powermock:powermock-core:2.0.0 -> !!!groupId-not-found!!! -# test? org.powermock:powermock-module-junit4:2.0.0 -> !!!groupId-not-found!!! - -DEPEND=" - >=virtual/jdk-11:* - ${CP_DEPEND}" -# test? ( -# !!!groupId-not-found!!! -# ) -#" - -RDEPEND=" - >=virtual/jre-1.8:* - ${CP_DEPEND}" - -DOCS=( {README,SECURITY}.md release-notes/{CREDITS,VERSION}-2.x ) - -S="${WORKDIR}/${PN}-${P}" - -JAVA_SRC_DIR=( "src/main/java" "src/moditect" ) -JAVA_RESOURCE_DIRS="src/main/resources" - -# JAVA_TEST_GENTOO_CLASSPATH="!!!groupId-not-found!!!,junit-4,!!!groupId-not-found!!!,!!!groupId-not-found!!!,!!!groupId-not-found!!!" -# JAVA_TEST_SRC_DIR="src/test/java" -# JAVA_TEST_RESOURCE_DIRS=( -# "src/test/resources" -# ) - -src_prepare() { - java-pkg-2_src_prepare - - sed -e 's:@package@:com.fasterxml.jackson.databind.cfg:g' \ - -e "s:@projectversion@:${PV}:g" \ - -e 's:@projectgroupid@:com.fasterxml.jackson.core:g' \ - -e "s:@projectartifactid@:${PN}:g" \ - "${JAVA_SRC_DIR}/com/fasterxml/jackson/databind/cfg/PackageVersion.java.in" \ - > "${JAVA_SRC_DIR}/com/fasterxml/jackson/databind/cfg/PackageVersion.java" || die -} - -src_install() { - default # https://bugs.gentoo.org/789582 - java-pkg-simple_src_install -} diff --git a/dev-java/jackson-dataformat-xml/Manifest b/dev-java/jackson-dataformat-xml/Manifest index 0ac67954bc80..e8a729e86a91 100644 --- a/dev-java/jackson-dataformat-xml/Manifest +++ b/dev-java/jackson-dataformat-xml/Manifest @@ -1,2 +1 @@ -DIST jackson-dataformat-xml-2.13.3.tar.gz 3201473 BLAKE2B 90f6b98325e3ae43e7ba560b077ee8fc8e5ad5004fd23b7c10a2c2a3ec7a674b700b80766690d2442820f87698fa5e33c440c2aa12cd521b7566e78eca50bbaa SHA512 52e26e1a398d90f75ef61d074ed1d149b9f13555f1878703b3148ed008f29f8802586a6020f3c1427a748a73b9a4ca56d86ffd769cf6cb7317a69e039345eefa DIST jackson-dataformat-xml-2.13.4.tar.gz 3203115 BLAKE2B c959c878c6905de9fee73fab87381296d30146ab755765e715f49f141ea80d3843116752710e78f270c96abb0a2dd784fff01769ce68c126b3c7bd5acbe1a880 SHA512 8b6c76d8b324ceffece806f2de1352e2b2b557d64f51885bec8e60033c254e9c5a9adad29c07b6a5aaa77d535245ad581f67768a62af7a44160221aae62115e6 diff --git a/dev-java/jackson-dataformat-xml/jackson-dataformat-xml-2.13.3-r1.ebuild b/dev-java/jackson-dataformat-xml/jackson-dataformat-xml-2.13.3-r1.ebuild deleted file mode 100644 index af94b82ff4ac..000000000000 --- a/dev-java/jackson-dataformat-xml/jackson-dataformat-xml-2.13.3-r1.ebuild +++ /dev/null @@ -1,110 +0,0 @@ -# Copyright 1999-2022 Gentoo Authors -# Distributed under the terms of the GNU General Public License v2 - -# Skeleton command: -# java-ebuilder --generate-ebuild --workdir . --pom pom.xml --download-uri https://github.com/FasterXML/jackson-dataformat-xml/archive/jackson-dataformat-xml-2.13.3.tar.gz --slot 0 --keywords "~amd64 ~arm ~arm64 ~ppc64 ~x86" --ebuild jackson-dataformat-xml-2.13.3.ebuild - -EAPI=8 - -JAVA_PKG_IUSE="doc source test" -MAVEN_ID="com.fasterxml.jackson.dataformat:jackson-dataformat-xml:2.13.3" -JAVA_TESTING_FRAMEWORKS="junit-4" - -inherit java-pkg-2 java-pkg-simple - -DESCRIPTION="Data format extension for Jackson" -HOMEPAGE="https://github.com/FasterXML/jackson-dataformat-xml" -SRC_URI="https://github.com/FasterXML/${PN}/archive/${P}.tar.gz" - -LICENSE="Apache-2.0" -SLOT="0" -KEYWORDS="amd64 ~arm arm64 ppc64 x86" - -# Common dependencies -# POM: pom.xml -# com.fasterxml.jackson.core:jackson-annotations:2.13.3 -> >=dev-java/jackson-annotations-2.13.3:2 -# com.fasterxml.jackson.core:jackson-core:2.13.3 -> >=dev-java/jackson-core-2.13.3:0 -# com.fasterxml.jackson.core:jackson-databind:2.13.3 -> >=dev-java/jackson-databind-2.13.3:0 -# com.fasterxml.woodstox:woodstox-core:6.2.7 -> >=dev-java/woodstox-core-6.2.8:0 -# org.codehaus.woodstox:stax2-api:4.2.1 -> >=dev-java/stax2-api-4.2.1:0 - -CP_DEPEND=" - ~dev-java/jackson-annotations-${PV}:2 - ~dev-java/jackson-core-${PV}:0 - ~dev-java/jackson-databind-${PV}:0 - >=dev-java/stax2-api-4.2.1-r1:0 - dev-java/woodstox-core:0 -" - -# Compile dependencies -# POM: pom.xml -# test? com.fasterxml.jackson.module:jackson-module-jakarta-xmlbind-annotations:2.13.3 -> >=dev-java/jackson-module-jakarta-xmlbind-2.13.3:0 -# test? com.sun.xml.stream:sjsxp:1.0.2 -> >=dev-java/sjsxp-1.0.2:0 -# test? jakarta.xml.bind:jakarta.xml.bind-api:3.0.1 -> >=dev-java/jaxb-api-3.0.1:3 -# test? junit:junit:4.13.1 -> >=dev-java/junit-4.13.2:4 - -DEPEND=" - >=virtual/jdk-11:* - ${CP_DEPEND} - test? ( - ~dev-java/jackson-module-jakarta-xmlbind-${PV}:0 - dev-java/jaxb-api:4 - dev-java/sjsxp:0 - ) -" - -RDEPEND=" - >=virtual/jre-1.8:* - ${CP_DEPEND}" - -DOCS=( README.md release-notes/{CREDITS,VERSION}-2.x ) - -S="${WORKDIR}/${PN}-${P}" - -JAVA_SRC_DIR=( "src/main/java" "src/moditect" ) -JAVA_RESOURCE_DIRS="src/main/resources" - -JAVA_TEST_GENTOO_CLASSPATH="jackson-module-jakarta-xmlbind,sjsxp,jaxb-api-4,junit-4" -JAVA_TEST_SRC_DIR="src/test/java" -JAVA_TEST_RESOURCE_DIRS="src/test/resources" - -src_prepare() { - java-pkg-2_src_prepare - - sed -e 's:@package@:com.fasterxml.jackson.dataformat.xml:g' \ - -e "s:@projectversion@:${PV}:g" \ - -e 's:@projectgroupid@:com.fasterxml.jackson.dataformat:g' \ - -e "s:@projectartifactid@:${PN}:g" \ - "${JAVA_SRC_DIR}/com/fasterxml/jackson/dataformat/xml/PackageVersion.java.in" \ - > "${JAVA_SRC_DIR}/com/fasterxml/jackson/dataformat/xml/PackageVersion.java" || die -} - -src_test() { - pushd src/test/java || die - local JAVA_TEST_RUN_ONLY=$(find * -name "*Test*.java" \ - ! -wholename "**/failing**/*.java" \ - ! -name "*TestBase.java" ) - popd - - JAVA_TEST_RUN_ONLY="${JAVA_TEST_RUN_ONLY//.java}" - JAVA_TEST_RUN_ONLY="${JAVA_TEST_RUN_ONLY//\//.}" - - # The same failure under openjdk-17 occurs upstream (running 'mvn test') - - # 1) testCollection(com.fasterxml.jackson.dataformat.xml.lists.ListAsObjectTest) - # com.fasterxml.jackson.databind.exc.InvalidDefinitionException: Failed to call `setAccess()` on Field 'first' due to - # `java.lang.reflect.InaccessibleObjectException`, problem: Unable to make field transient java.util.LinkedList$Node - # java.util.LinkedList.first accessible: module java.base does not "opens java.util" to unnamed module @42bb2aee - - local vm_version="$(java-config -g PROVIDES_VERSION)" - if ver_test "${vm_version}" -ge "17" ; then - JAVA_TEST_EXTRA_ARGS+=( --add-opens=java.base/java.util=ALL-UNNAMED ) - fi - - java-pkg-simple_src_test -} - -src_install() { - default # https://bugs.gentoo.org/789582 - java-pkg-simple_src_install -} diff --git a/dev-java/jackson-dataformat-yaml/Manifest b/dev-java/jackson-dataformat-yaml/Manifest index 14e9a15bca6e..3788f2029f74 100644 --- a/dev-java/jackson-dataformat-yaml/Manifest +++ b/dev-java/jackson-dataformat-yaml/Manifest @@ -1,2 +1 @@ -DIST jackson-dataformats-text-2.13.3.tar.gz 3528981 BLAKE2B 98593f45e663905c15ab5cb37152c95d69a0121515990fac0c66f640d93af83cd51802e2856a4e8df6b82c0121ac4fcd20774fd6a3841e019e1da56c599ed9a9 SHA512 77fad3e6ab5ad55d3a46ffaee3482e9f0dbfa36ce67d5ad31e0b7cde667536387f1dce5bc8296733a28efb09f423785aca7291d9ba85a67ca2b94ef4c8766d7f DIST jackson-dataformats-text-2.13.4.tar.gz 3530892 BLAKE2B 3cbfcbbd33aeac67476caa453b77c19a1da88a9fb9482360bf427af3f41d689a04fc1ecb28d4424c5bfd7436979f1b03c215ca88a0064338f53dfd169f288562 SHA512 792f416c7cabd639b42bd93205e55328ace53c093e59d57eeaedc27a61358527515031c70dd503702471a13237f6389ca118e453da0ab002e20a531885d58a11 diff --git a/dev-java/jackson-dataformat-yaml/jackson-dataformat-yaml-2.13.3-r1.ebuild b/dev-java/jackson-dataformat-yaml/jackson-dataformat-yaml-2.13.3-r1.ebuild deleted file mode 100644 index 9e85e26ba239..000000000000 --- a/dev-java/jackson-dataformat-yaml/jackson-dataformat-yaml-2.13.3-r1.ebuild +++ /dev/null @@ -1,60 +0,0 @@ -# Copyright 1999-2022 Gentoo Authors -# Distributed under the terms of the GNU General Public License v2 - -# Skeleton command: -# java-ebuilder --generate-ebuild --workdir . --pom pom.xml --download-uri https://github.com/FasterXML/jackson-dataformats-text/archive/jackson-dataformats-text-2.13.3.tar.gz --slot 0 --keywords "~amd64 ~arm ~arm64 ~ppc64 ~x86" --ebuild jackson-dataformat-yaml-2.13.3.ebuild - -EAPI=8 - -JAVA_PKG_IUSE="doc source test" -MAVEN_ID="com.fasterxml.jackson.dataformat:jackson-dataformat-yaml:2.13.3" -JAVA_TESTING_FRAMEWORKS="junit-4" - -inherit java-pkg-2 java-pkg-simple - -DESCRIPTION="Support for reading and writing YAML-encoded data via Jackson abstractions" -HOMEPAGE="https://github.com/FasterXML/jackson-dataformats-text" -SRC_URI="https://github.com/FasterXML/jackson-dataformats-text/archive/jackson-dataformats-text-${PV}.tar.gz" - -LICENSE="Apache-2.0" -SLOT="0" -KEYWORDS="amd64 ~arm arm64 ppc64 x86" - -DEPEND=" - ~dev-java/jackson-core-${PV}:0 - ~dev-java/jackson-databind-${PV}:0 - >=dev-java/snakeyaml-1.30-r1:0 - >=virtual/jdk-11:* -" - -RDEPEND=">=virtual/jre-1.8:*" - -DOCS=( README.md release-notes/{CREDITS,VERSION} ) - -S="${WORKDIR}/jackson-dataformats-text-jackson-dataformats-text-${PV}/yaml" - -JAVA_CLASSPATH_EXTRA="jackson-core,jackson-databind,snakeyaml" -JAVA_SRC_DIR=( "src/main/java" "src/moditect" ) -JAVA_RESOURCE_DIRS="src/main/resources" - -JAVA_TEST_GENTOO_CLASSPATH="junit-4" -JAVA_TEST_SRC_DIR="src/test/java" -JAVA_TEST_RESOURCE_DIRS="src/test/resources" -JAVA_TEST_EXCLUDES=( - # Upstream's usual exclude pattern: "**/failing**/*.java" - com.fasterxml.jackson.dataformat.yaml.failing.ObjectIdWithTree2Test - com.fasterxml.jackson.dataformat.yaml.failing.PolymorphicWithObjectId25Test - com.fasterxml.jackson.dataformat.yaml.failing.SimpleGeneration215Test -) - -src_prepare() { - default - java-pkg-2_src_prepare - - sed -e 's:@package@:com.fasterxml.jackson.dataformat.yaml:g' \ - -e "s:@projectversion@:${PV}:g" \ - -e 's:@projectgroupid@:com.fasterxml.jackson.dataformat:g' \ - -e "s:@projectartifactid@:${PN}:g" \ - "${JAVA_SRC_DIR}/com/fasterxml/jackson/dataformat/yaml/PackageVersion.java.in" \ - > "${JAVA_SRC_DIR}/com/fasterxml/jackson/dataformat/yaml/PackageVersion.java" || die -} diff --git a/dev-java/jackson-module-jakarta-xmlbind/Manifest b/dev-java/jackson-module-jakarta-xmlbind/Manifest index 4152549fa1d4..9066121ef023 100644 --- a/dev-java/jackson-module-jakarta-xmlbind/Manifest +++ b/dev-java/jackson-module-jakarta-xmlbind/Manifest @@ -1,2 +1 @@ -DIST jackson-module-jakarta-xmlbind-2.13.3.tar.gz 2145569 BLAKE2B 13864e4272d40e8425232482a67a2bc720ff294e93ec623589bd0b7286e2c63c2b724bc1033eb19437cdea23db0b11142380715fc300c32e8af9dba22eeed407 SHA512 2807a9e1d3531f3553a2ab6bb64e0ece2809ca9d2facae320dbd38efe0797cdc7ab11e9b284122d75a98a50eda9bc0cfb0f098ca0921e3bf67a0e38b5252a14d DIST jackson-module-jakarta-xmlbind-2.13.4.tar.gz 2146134 BLAKE2B ae20a115464a052a8403172706025fc595d6e6aeafda60cf3cce784e1e0a29f38d672fb5205e9dbd74de1ef9615f3bfd0268711d9992c123cac0ef692e59be3a SHA512 0706566a9e5e68697d54319a425fde53948ad610a6eb9519d2e02d375ea280468c7e9e3d5ff4378535ed3a71480f207257a558f73819b1b81edc69f9d3c317a8 diff --git a/dev-java/jackson-module-jakarta-xmlbind/jackson-module-jakarta-xmlbind-2.13.3-r1.ebuild b/dev-java/jackson-module-jakarta-xmlbind/jackson-module-jakarta-xmlbind-2.13.3-r1.ebuild deleted file mode 100644 index 3bb5e6e244e1..000000000000 --- a/dev-java/jackson-module-jakarta-xmlbind/jackson-module-jakarta-xmlbind-2.13.3-r1.ebuild +++ /dev/null @@ -1,84 +0,0 @@ -# Copyright 1999-2022 Gentoo Authors -# Distributed under the terms of the GNU General Public License v2 - -# Skeleton command: -# java-ebuilder --generate-ebuild --workdir . --pom pom.xml --download-uri https://github.com/FasterXML/jackson-modules-base/archive/jackson-modules-base-2.13.3.tar.gz --slot 0 --keywords "~amd64 ~arm ~arm64 ~ppc64 ~x86" --ebuild jackson-module-jakarta-xmlbind-2.13.3.ebuild - -EAPI=8 - -JAVA_PKG_IUSE="doc source test" -MAVEN_ID="com.fasterxml.jackson.module:jackson-module-jakarta-xmlbind-annotations:2.13.3" -JAVA_TESTING_FRAMEWORKS="junit-4" - -inherit java-pkg-2 java-pkg-simple - -DESCRIPTION="Support for using Jakarta XML Bind (aka JAXB 3.0) annotations" -HOMEPAGE="https://github.com/FasterXML/jackson-modules-base" -SRC_URI="https://github.com/FasterXML/jackson-modules-base/archive/jackson-modules-base-${PV}.tar.gz -> ${P}.tar.gz" - -LICENSE="Apache-2.0" -SLOT="0" -KEYWORDS="amd64 ~arm arm64 ppc64 x86" - -# Common dependencies -# POM: pom.xml -# com.fasterxml.jackson.core:jackson-annotations:2.13.3 -> >=dev-java/jackson-annotations-2.13.3:2 -# com.fasterxml.jackson.core:jackson-core:2.13.3 -> >=dev-java/jackson-core-2.13.3:0 -# com.fasterxml.jackson.core:jackson-databind:2.13.3 -> >=dev-java/jackson-databind-2.13.3:0 -# com.sun.activation:jakarta.activation:2.0.1 -> >=dev-java/jakarta-activation-2.0.1:2 -# jakarta.xml.bind:jakarta.xml.bind-api:3.0.1 -> >=dev-java/jaxb-api-3.0.1:3 - -CP_DEPEND=" - ~dev-java/jackson-annotations-${PV}:2 - ~dev-java/jackson-core-${PV}:0 - ~dev-java/jackson-databind-${PV}:0 - dev-java/jakarta-activation:1 - dev-java/jaxb-api:4 -" - -# Compile dependencies -# POM: pom.xml -# test? junit:junit:4.13.1 -> >=dev-java/junit-4.13.2:4 -# test? org.glassfish.jaxb:jaxb-runtime:3.0.1 -> !!!groupId-not-found!!! - -DEPEND=" - >=virtual/jdk-11:* - ${CP_DEPEND} - test? ( - dev-java/jaxb-runtime:4 - ) -" - -RDEPEND=" - >=virtual/jre-1.8:* - ${CP_DEPEND}" - -S="${WORKDIR}/jackson-modules-base-jackson-modules-base-${PV}/jakarta-xmlbind/" - -JAVA_SRC_DIR=( "src/main/java" "src/moditect" ) -JAVA_RESOURCE_DIRS="src/main/resources" - -JAVA_TEST_GENTOO_CLASSPATH="jaxb-runtime-4,junit-4" -JAVA_TEST_SRC_DIR="src/test/java" - -JAVA_TEST_EXCLUDES=( - # Upstream does not run these - com.fasterxml.jackson.module.jakarta.xmlbind.failing.TestUnwrapping - com.fasterxml.jackson.module.jakarta.xmlbind.failing.TestXmlID3 -) - -src_prepare() { - java-pkg-2_src_prepare - - sed -e 's:@package@:com.fasterxml.jackson.module.jakarta.xmlbind:g' \ - -e "s:@projectversion@:${PV}:g" \ - -e 's:@projectgroupid@:com.fasterxml.jackson.module:g' \ - -e "s:@projectartifactid@:jackson-module-jakarta-xmlbind-annotations:g" \ - "${JAVA_SRC_DIR}/com/fasterxml/jackson/module/jakarta/xmlbind/PackageVersion.java.in" \ - > "${JAVA_SRC_DIR}/com/fasterxml/jackson/module/jakarta/xmlbind/PackageVersion.java" || die -} - -src_install() { - default # https://bugs.gentoo.org/789582 - java-pkg-simple_src_install -} diff --git a/dev-java/jakartaee-migration/Manifest b/dev-java/jakartaee-migration/Manifest index f40987c027dd..63f3b30af0d7 100644 --- a/dev-java/jakartaee-migration/Manifest +++ b/dev-java/jakartaee-migration/Manifest @@ -1,3 +1,2 @@ -DIST jakartaee-migration-1.0.1-sources.tar.gz 35763 BLAKE2B 9e739668a7ebd65396960cd2447ecf2bc114cb85a2c554a17cb8478bef13f70f2fed26cc96553a22e7279dde698e1c094ca4dc7a8695ff9f82903ebe8badbd69 SHA512 6caaadfe5dcb21a859f2e401c039832b2774d8876ac724c3159b28c80a1153f7cd1c6706ba29a38d5f748cd2e55a85bd9bfecfb3a405f86aa85637ff3ca3c5f7 DIST jakartaee-migration-1.0.3-sources.tar.gz 38243 BLAKE2B e1c05c05dd16ec6d54f0eb3523aed14a3fcbc9c0999b54e7c240c5ebfbb968a8cc3025855485318c19f0e85931ea239f4f08efbd0d042c7ad163c1fe5d3819f9 SHA512 79947fe47d55e4e93a417118e7a41fd79614b3fe3bfad967bfdcc865121c9247f92ecd99231e08abb2187036cdb1dceb85b8f2bc695c5bd2ecbf48a84bdd3b2a DIST jakartaee-migration-1.0.4-sources.tar.gz 38400 BLAKE2B c0c0151adfde56632ad95919a88eedd6a44056e2d29320e63e0dc64c59cf7ba928135f817ddb3c79a96dd7a8418ab92c8fe4aa9f50a51442bb55384349de603f SHA512 a9d49463f44affa1c5f57d9342e7b4dc77a829c904ba2376f87f086c3662f01e05a2b1cfe2dc746e33605a66849f12415ebb2b63eb05c5e476a4eab9ffd39644 diff --git a/dev-java/jakartaee-migration/jakartaee-migration-1.0.1.ebuild b/dev-java/jakartaee-migration/jakartaee-migration-1.0.1.ebuild deleted file mode 100644 index 2f557abf9a8c..000000000000 --- a/dev-java/jakartaee-migration/jakartaee-migration-1.0.1.ebuild +++ /dev/null @@ -1,92 +0,0 @@ -# Copyright 1999-2022 Gentoo Authors -# Distributed under the terms of the GNU General Public License v2 - -# Skeleton command: -# java-ebuilder --generate-ebuild --workdir . --pom pom.xml --download-uri https://ftp.fau.de/apache/tomcat/jakartaee-migration/v1.0.1/source/jakartaee-migration-1.0.1-src.tar.gz --slot 0 --keywords "~amd64" --ebuild jakartaee-migration-1.0.1.ebuild - -EAPI=8 - -JAVA_PKG_IUSE="doc source test" -MAVEN_ID="org.apache.tomcat:jakartaee-migration:1.0.1" -JAVA_TESTING_FRAMEWORKS="junit-4" - -inherit java-pkg-2 java-pkg-simple - -DESCRIPTION="Apache Tomcat tool for migration from Java EE 8 to Jakarta EE 9" -HOMEPAGE="https://tomcat.apache.org" -SRC_URI="mirror://apache/tomcat/${PN}/v${PV}/source/${P}-src.tar.gz -> ${P}-sources.tar.gz" -LICENSE="Apache-2.0" -SLOT="0" -KEYWORDS="amd64" - -# Common dependencies -# POM: pom.xml -# commons-io:commons-io:2.8.0 -> >=dev-java/commons-io-2.8.0:1 -# org.apache.bcel:bcel:6.5.0 -> >=dev-java/bcel-6.5.0:0 -# org.apache.commons:commons-compress:1.20 -> >=dev-java/commons-compress-1.20:0 - -CDEPEND=" - dev-java/ant-core:0 - dev-java/bcel:0 - >=dev-java/commons-compress-1.20:0 - dev-java/commons-io:1 -" - -# Compile dependencies -# POM: pom.xml -# org.apache.ant:ant:1.10.9 -> !!!groupId-not-found!!! -# POM: pom.xml -# test? junit:junit:4.13.1 -> >=dev-java/junit-4.13.1:4 - -DEPEND=" - >=virtual/jdk-1.8:* - ${CDEPEND} -" - -RDEPEND=" - >=virtual/jre-1.8:* - ${CDEPEND}" - -S="${WORKDIR}/${P}" - -JAVA_LAUNCHER_FILENAME="${PN}" - -JAVA_GENTOO_CLASSPATH="ant-core,bcel,commons-compress,commons-io-1" -JAVA_SRC_DIR="src/main/java" -JAVA_MAIN_CLASS="org.apache.tomcat.jakartaee.MigrationCLI" -JAVA_RESOURCE_DIRS=( - "src/main/resources" -) - -JAVA_TEST_GENTOO_CLASSPATH="junit-4" -JAVA_TEST_SRC_DIR="src/test/java" -JAVA_TEST_RESOURCE_DIRS=( - "src/test/resources" -) -JAVA_TEST_EXCLUDES=( - "org.apache.tomcat.jakartaee.TesterConstants" -) - -src_prepare() { - default - sed -i "s/\${project.version}/${PV}/g" src/main/resources/info.properties -} - -src_test() { - # we need to create jar files for the tests the same way as it's done using pom.xml - local implementation_version=$(grep Implementation-Version pom.xml | grep -oE "[0-9]+\.[0-9]+\.[0-9]+") - mkdir -p target/test-classes/META-INF || die - pushd target/test-classes || die - echo "Implementation-Version: ${implementation_version}" > META-INF/MANIFEST.MF - ejavac -d . -encoding ${JAVA_ENCODING} $(find "${S}/${JAVA_TEST_SRC_DIR}" -name CommonGatewayInterface.java) || die - jar cfm cgi-api.jar META-INF/MANIFEST.MF $(find -name CommonGatewayInterface.class) || die - ejavac -d . -encoding ${JAVA_ENCODING} $(find "${S}/${JAVA_TEST_SRC_DIR}" -name HelloCGI.java) || die - jar cfm hellocgi.jar META-INF/MANIFEST.MF $(find -name HelloCGI.class) || die - for enc in rsa dsa ec; do - cp hellocgi.jar hellocgi-signed-${enc}.jar || die - jarsigner -keystore "${S}/src/test/resources/keystore.p12" -storepass apache hellocgi-signed-${enc}.jar ${enc} || die - done - popd - - java-pkg-simple_src_test -} diff --git a/dev-java/jdbc-postgresql/Manifest b/dev-java/jdbc-postgresql/Manifest index b8b5d45e578b..3da68de820d0 100644 --- a/dev-java/jdbc-postgresql/Manifest +++ b/dev-java/jdbc-postgresql/Manifest @@ -1,2 +1 @@ -DIST postgresql-jdbc-42.4.1.src.tar.gz 969554 BLAKE2B 76035b2362c304d6263b9549b2ecbedc6e1cfedeba9c2c35f07d29dada39e5bce93e939abb8cb2232a428b0341c5cd5e6ae22de6106292c4d28243e3e0e6fc00 SHA512 a49c5b68a26ba6fd1b150c45da2ec58ea4435b7c36b8aa9bf6c3d33b6a265dabe7da51705e9d7234a640c8f6ccb5c3abb639db2d7bc38e6f4e26550b05b4a844 DIST postgresql-jdbc-42.5.0.src.tar.gz 971368 BLAKE2B 961ba5af17f27792f44b715e8a248950926f1e7a384c3bb7ef4d9f919c84833129d45bcaeaded17d8d8cb3733b3f70cde76c126c501c7c1c1ed8a356c2e2f78d SHA512 432347622d6a1034048cb2dc18e7c5fdb1e843a27db505c8ea0381fee700480682222f4b8a285d8d774a0732398cc6254692c8f130c1814a464966b9dba72f64 diff --git a/dev-java/jdbc-postgresql/jdbc-postgresql-42.4.1.ebuild b/dev-java/jdbc-postgresql/jdbc-postgresql-42.4.1.ebuild deleted file mode 100644 index ef8ca1586488..000000000000 --- a/dev-java/jdbc-postgresql/jdbc-postgresql-42.4.1.ebuild +++ /dev/null @@ -1,60 +0,0 @@ -# Copyright 1999-2022 Gentoo Authors -# Distributed under the terms of the GNU General Public License v2 - -# Skeleton command: -# java-ebuilder --generate-ebuild --workdir . --pom pom.xml --download-uri https://jdbc.postgresql.org/download/postgresql-jdbc-42.4.1.src.tar.gz --slot 0 --keywords "~amd64 ~ppc64 ~x86" --ebuild jdbc-postgresql-42.4.1.ebuild - -EAPI=8 - -JAVA_PKG_IUSE="doc source" -MAVEN_ID="org.postgresql:postgresql:42.4.1" -# We don't have junit-vintage and junit-jupiter. -# JAVA_TESTING_FRAMEWORKS="junit-vintage junit-jupiter junit-4" - -inherit java-pkg-2 java-pkg-simple - -DESCRIPTION="Java JDBC 4.2 (JRE 8+) driver for PostgreSQL database" -HOMEPAGE="https://jdbc.postgresql.org/" -SRC_URI="https://jdbc.postgresql.org/download/postgresql-jdbc-${PV}.src.tar.gz" - -LICENSE="BSD-2" -SLOT="0" -KEYWORDS="amd64 ppc64 x86" - -# Common dependencies -# POM: pom.xml -# com.ongres.scram:client:2.1 -> !!!groupId-not-found!!! -# uk.org.webcompere:system-stubs-jupiter:1.2.0 -> !!!groupId-not-found!!! - -CP_DEPEND="dev-java/scram:0" - -# Compile dependencies -# POM: pom.xml -# test? junit:junit:4.13 -> >=dev-java/junit-4.13.2:4 -# test? org.junit.jupiter:junit-jupiter-api:5.6.0 -> !!!groupId-not-found!!! -# test? org.junit.jupiter:junit-jupiter-engine:5.6.0 -> !!!groupId-not-found!!! -# test? org.junit.jupiter:junit-jupiter-params:5.6.0 -> !!!groupId-not-found!!! -# test? org.junit.vintage:junit-vintage-engine:5.6.0 -> !!!groupId-not-found!!! -# test? se.jiderhamn:classloader-leak-test-framework:1.1.1 -> !!!groupId-not-found!!! - -DEPEND=" - >=virtual/jdk-1.8:* - ${CP_DEPEND}" -# test? ( -# !!!groupId-not-found!!! -# ) -# " - -RDEPEND=" - >=virtual/jre-1.8:* - ${CP_DEPEND}" - -S="${WORKDIR}/postgresql-${PV}-jdbc-src" - -JAVA_MAIN_CLASS="org.postgresql.util.PGJDBCMain" -JAVA_SRC_DIR="src/main/java" -JAVA_RESOURCE_DIRS="src/main/resources" - -# JAVA_TEST_GENTOO_CLASSPATH="junit-4,!!!groupId-not-found!!!,!!!groupId-not-found!!!,!!!groupId-not-found!!!,!!!groupId-not-found!!!,!!!groupId-not-found!!!" -# JAVA_TEST_SRC_DIR="src/test/java" -# JAVA_TEST_RESOURCE_DIRS="src/test/resources" diff --git a/dev-java/xerial-core/Manifest b/dev-java/xerial-core/Manifest index 9e1361d1c318..871466add435 100644 --- a/dev-java/xerial-core/Manifest +++ b/dev-java/xerial-core/Manifest @@ -1,2 +1 @@ -DIST xerial-core-2.0.1.tar.bz2 519709 BLAKE2B 3d81bda265e3b3b37a50a62061298f23de7c2947a9d50ba6eac336c3ec09fcaaeea84d456e344b0d2ae16710870025a869c2359a17f0956c8dda557804e9d5ff SHA512 39236e8a653301a6899ce80d3240d505e91f0cfc8878fa1a698113d06f3af3fd7adef540d72da1c0e1fb7101542c43e92fb9388243d95c3185a561532c18c6fb DIST xerial-core-2.1.tar.gz 20598090 BLAKE2B d93021b1becb90a62aacc7337294fb71b0da769461947e935091c65e3e5fda2e454ebda295b7ad37d3b47993472b535588698a618d50243e00d58d1ea500284b SHA512 c762fda93e3da1efe110c667cf84cace7fd7c9b3ac35a764edd2b5e1996034a16a4a43ff5c3e298ff0b96cfc83d18994463c534301e0fab5a75c91cf03b6f89b diff --git a/dev-java/xerial-core/xerial-core-2.0.1-r1.ebuild b/dev-java/xerial-core/xerial-core-2.0.1-r1.ebuild deleted file mode 100644 index 585c67d8e0b1..000000000000 --- a/dev-java/xerial-core/xerial-core-2.0.1-r1.ebuild +++ /dev/null @@ -1,48 +0,0 @@ -# Copyright 1999-2022 Gentoo Authors -# Distributed under the terms of the GNU General Public License v2 - -# Skeleton command: -# java-ebuilder --generate-ebuild --workdir . --pom pom.xml --download-uri mirror://gentoo/distfiles/4f/xerial-core-2.0.1.tar.bz2 --slot 0 --keywords "~amd64 ~x86" --ebuild xerial-core-2.0.1-r1.ebuild - -EAPI=8 - -JAVA_PKG_IUSE="doc source test" -MAVEN_ID="org.xerial:xerial-core:2.0.1" -JAVA_TESTING_FRAMEWORKS="junit-4" - -inherit java-pkg-2 java-pkg-simple - -DESCRIPTION="Core library of the Xerial project." -HOMEPAGE="https://xerial.org" -# SRC_URI="https://github.com/xerial/xerial-java/archive/refs/tags/xerial-core-${PV}.tar.gz" -# Downloading from github is broken -SRC_URI="https://dev.gentoo.org/~ercpe/distfiles/${CATEGORY}/${PN}/${P}.tar.bz2" - -LICENSE="Apache-2.0" -SLOT="0" -KEYWORDS="amd64 ~arm arm64 ppc64 x86" - -DEPEND=">=virtual/jdk-1.8:*" -RDEPEND=">=virtual/jre-1.8:*" - -S="${WORKDIR}/${P}" - -JAVA_SRC_DIR="src/main/java" -JAVA_RESOURCE_DIRS="src/main/java" - -JAVA_TEST_GENTOO_CLASSPATH="junit-4" -JAVA_TEST_SRC_DIR="src/test/java" -JAVA_TEST_RESOURCE_DIRS=( - "src/test/java" - "src/test/resources" -) - -src_test() { - # 1) listResoucesInJAR(org.xerial.util.FileResourceTest) - # java.lang.AssertionError: at least one resource must be found in org.junit.runner - local vm_version="$(java-config -g PROVIDES_VERSION)" - if [[ "${vm_version}" != "1.8" ]] ; then - JAVA_TEST_EXCLUDES+=( "org.xerial.util.FileResourceTest" ) - fi - java-pkg-simple_src_test -} diff --git a/dev-java/xsdlib/xsdlib-2022.7.ebuild b/dev-java/xsdlib/xsdlib-2022.7.ebuild index 19e095b46857..4456014da2c5 100644 --- a/dev-java/xsdlib/xsdlib-2022.7.ebuild +++ b/dev-java/xsdlib/xsdlib-2022.7.ebuild @@ -18,7 +18,7 @@ SRC_URI="https://github.com/xmlark/msv/archive/msv-${PV}.tar.gz" LICENSE="BSD-1" SLOT="0" -KEYWORDS="~amd64 ~arm arm64 ppc64 x86 ~amd64-linux ~x86-linux ~ppc-macos ~x64-macos ~sparc-solaris ~x64-solaris ~x86-solaris" +KEYWORDS="amd64 ~arm arm64 ppc64 x86 ~amd64-linux ~x86-linux ~ppc-macos ~x64-macos ~sparc-solaris ~x64-solaris ~x86-solaris" # Common dependencies # POM: pom.xml |
