summaryrefslogtreecommitdiff
path: root/dev-java
diff options
context:
space:
mode:
Diffstat (limited to 'dev-java')
-rw-r--r--dev-java/angus-activation/angus-activation-1.0.0.ebuild43
-rw-r--r--dev-java/apiguardian-api/apiguardian-api-1.1.2.ebuild36
-rw-r--r--dev-java/gradle-bin/gradle-bin-7.5.ebuild2
-rw-r--r--dev-java/hawtjni-runtime/Manifest1
-rw-r--r--dev-java/hawtjni-runtime/hawtjni-runtime-1.15-r1.ebuild29
-rw-r--r--dev-java/jackson-dataformat-yaml/jackson-dataformat-yaml-2.13.3.ebuild79
-rw-r--r--dev-java/jakarta-mail-api/jakarta-mail-api-2.1.0.ebuild81
-rw-r--r--dev-java/joda-convert/joda-convert-2.2.2-r1.ebuild71
-rw-r--r--dev-java/joda-time/Manifest1
-rw-r--r--dev-java/joda-time/joda-time-2.10.10-r1.ebuild75
-rw-r--r--dev-java/mill-bin/mill-bin-0.10.5.ebuild2
-rw-r--r--dev-java/plexus-classworlds/Manifest1
-rw-r--r--dev-java/plexus-classworlds/plexus-classworlds-2.2.3.ebuild41
-rw-r--r--dev-java/snakeyaml/snakeyaml-1.30.ebuild95
14 files changed, 2 insertions, 555 deletions
diff --git a/dev-java/angus-activation/angus-activation-1.0.0.ebuild b/dev-java/angus-activation/angus-activation-1.0.0.ebuild
deleted file mode 100644
index effcb2f8468a..000000000000
--- a/dev-java/angus-activation/angus-activation-1.0.0.ebuild
+++ /dev/null
@@ -1,43 +0,0 @@
-# Copyright 1999-2022 Gentoo Authors
-# Distributed under the terms of the GNU General Public License v2
-
-# Skeleton command:
-# java-ebuilder --generate-ebuild --workdir . --pom pom.xml --download-uri https://github.com/eclipse-ee4j/angus-activation/archive/refs/tags/1.0.0.tar.gz --slot 0 --keywords "~amd64 ~arm64 ~ppc64 ~x86" --ebuild angus-activation-1.0.0.ebuild
-
-EAPI=8
-
-JAVA_PKG_IUSE="doc source"
-MAVEN_ID="org.eclipse.angus:angus-activation:1.0.0"
-
-inherit java-pkg-2 java-pkg-simple
-
-DESCRIPTION="Provides the implementation of the Jakarta Activation Specification"
-HOMEPAGE="https://github.com/eclipse-ee4j/angus-activation"
-SRC_URI="https://github.com/eclipse-ee4j/${PN}/archive/refs/tags/${PV}.tar.gz -> ${P}.tar.gz"
-
-LICENSE="EPL-1.0"
-SLOT="0"
-KEYWORDS="amd64 ~arm arm64 ppc64 x86"
-
-# Common dependencies
-# POM: pom.xml
-# jakarta.activation:jakarta.activation-api:2.1.0 -> !!!suitble-mavenVersion-not-found!!!
-
-CP_DEPEND=">=dev-java/jakarta-activation-api-2.1.0:2"
-DEPEND="${CP_DEPEND}
- >=virtual/jdk-1.8:*"
-
-RDEPEND="${CP_DEPEND}
- >=virtual/jre-1.8:*"
-
-DOCS=( ../{CONTRIBUTING,LICENSE,NOTICE,README}.md )
-
-S="${WORKDIR}/${P}/activation-registry"
-
-JAVA_SRC_DIR="src/main/java"
-JAVA_RESOURCE_DIRS="src/main/resources"
-
-src_install() {
- default # https://bugs.gentoo.org/789582
- java-pkg-simple_src_install
-}
diff --git a/dev-java/apiguardian-api/apiguardian-api-1.1.2.ebuild b/dev-java/apiguardian-api/apiguardian-api-1.1.2.ebuild
deleted file mode 100644
index b9bd660df331..000000000000
--- a/dev-java/apiguardian-api/apiguardian-api-1.1.2.ebuild
+++ /dev/null
@@ -1,36 +0,0 @@
-# Copyright 2022 Gentoo Authors
-# Distributed under the terms of the GNU General Public License v2
-
-EAPI=8
-
-JAVA_PKG_IUSE="doc source"
-MAVEN_ID="org.apiguardian:apiguardian-api:1.1.2"
-
-inherit java-pkg-2 java-pkg-simple
-
-DESCRIPTION="@org.apiguardian.api.API Java annotation provider"
-HOMEPAGE="https://github.com/apiguardian-team/apiguardian"
-SRC_URI="https://github.com/apiguardian-team/apiguardian/archive/r${PV}.tar.gz -> ${P}.tar.gz"
-
-LICENSE="Apache-2.0"
-SLOT="0"
-KEYWORDS="amd64 ~arm arm64 ppc64 x86"
-
-DEPEND="
- >=virtual/jdk-1.8:*
-"
-
-RDEPEND="
- >=virtual/jre-1.8:*
-"
-
-DOCS=( README.md )
-
-S="${WORKDIR}/${PN%-api}-r${PV}"
-
-JAVA_SRC_DIR=( src/{main,module}/java )
-
-src_install() {
- default # https://bugs.gentoo.org/789582
- java-pkg-simple_src_install
-}
diff --git a/dev-java/gradle-bin/gradle-bin-7.5.ebuild b/dev-java/gradle-bin/gradle-bin-7.5.ebuild
index 8dedd9ecd1ef..0e7b49ee8847 100644
--- a/dev-java/gradle-bin/gradle-bin-7.5.ebuild
+++ b/dev-java/gradle-bin/gradle-bin-7.5.ebuild
@@ -17,7 +17,7 @@ HOMEPAGE="https://www.gradle.org/"
LICENSE="Apache-2.0"
SLOT="${PV}"
-KEYWORDS="~amd64 ~x86"
+KEYWORDS="amd64 x86"
DEPEND="app-eselect/eselect-gradle"
BDEPEND="app-arch/unzip"
diff --git a/dev-java/hawtjni-runtime/Manifest b/dev-java/hawtjni-runtime/Manifest
index 473ef1cdabf5..1697e9eae264 100644
--- a/dev-java/hawtjni-runtime/Manifest
+++ b/dev-java/hawtjni-runtime/Manifest
@@ -1,2 +1 @@
-DIST hawtjni-project-1.15.tar.gz 1606236 BLAKE2B 52357dbefde43ec82cf218ada90642d118ebaa6a6be173cc1f4f48377fda95b902f0a90dfb60822c02c144b9bf13d0800c94d67cc2f9c76e607bbbb80a80898e SHA512 1a93658bf8621c770cf97b546c6a5c0cf1821b06cb16dbc872ad0c830c599d3947ffe56b4cca16217a510d4e929ebcfc5eabdf4ad4364f5225b53d22c7d48abb
DIST hawtjni-project-1.18.tar.gz 1615093 BLAKE2B a195bcfb7c213ec4451605f62a1ab3546b7fa160a03d8c6c1a77a58e103481a196845d924d9f1a08cc2a17dfd71f9428f69a64983df00333cc00435c7dde2e5d SHA512 beeacd92c9b4fef413cb2d339041042ffd79fe7cb62c4fa3bcc8c2d758402183a5806ebd0ee91754f9f0025f4115022c71705e8f6330f2fa8b8cead774a30bf0
diff --git a/dev-java/hawtjni-runtime/hawtjni-runtime-1.15-r1.ebuild b/dev-java/hawtjni-runtime/hawtjni-runtime-1.15-r1.ebuild
deleted file mode 100644
index 9c6ad50feb44..000000000000
--- a/dev-java/hawtjni-runtime/hawtjni-runtime-1.15-r1.ebuild
+++ /dev/null
@@ -1,29 +0,0 @@
-# Copyright 1999-2021 Gentoo Authors
-# Distributed under the terms of the GNU General Public License v2
-
-EAPI=7
-
-JAVA_PKG_IUSE="doc source"
-
-inherit java-pkg-2 java-pkg-simple
-
-MY_P="hawtjni-project-${PV}"
-
-DESCRIPTION="A JNI code generator based on the generator used by the Eclipse SWT project"
-HOMEPAGE="https://github.com/fusesource/hawtjni"
-SRC_URI="https://github.com/fusesource/hawtjni/archive/${MY_P}.tar.gz"
-
-LICENSE="Apache-2.0"
-SLOT="0"
-KEYWORDS="amd64 ~arm arm64 ppc64 x86"
-
-DEPEND=">=virtual/jdk-1.8:*"
-RDEPEND=">=virtual/jre-1.8:*"
-
-S="${WORKDIR}/hawtjni-${MY_P}/${PN}/src"
-JAVA_SRC_DIR="main/java"
-
-src_install() {
- java-pkg-simple_src_install
- dodoc ../../{changelog,notice,readme}.md
-}
diff --git a/dev-java/jackson-dataformat-yaml/jackson-dataformat-yaml-2.13.3.ebuild b/dev-java/jackson-dataformat-yaml/jackson-dataformat-yaml-2.13.3.ebuild
deleted file mode 100644
index 8dd76fc9caca..000000000000
--- a/dev-java/jackson-dataformat-yaml/jackson-dataformat-yaml-2.13.3.ebuild
+++ /dev/null
@@ -1,79 +0,0 @@
-# Copyright 1999-2022 Gentoo Authors
-# Distributed under the terms of the GNU General Public License v2
-
-# Skeleton command:
-# java-ebuilder --generate-ebuild --workdir . --pom pom.xml --download-uri https://github.com/FasterXML/jackson-dataformats-text/archive/jackson-dataformats-text-2.13.3.tar.gz --slot 0 --keywords "~amd64 ~arm ~arm64 ~ppc64 ~x86" --ebuild jackson-dataformat-yaml-2.13.3.ebuild
-
-EAPI=8
-
-JAVA_PKG_IUSE="doc source test"
-MAVEN_ID="com.fasterxml.jackson.dataformat:jackson-dataformat-yaml:2.13.3"
-JAVA_TESTING_FRAMEWORKS="junit-4"
-
-inherit java-pkg-2 java-pkg-simple
-
-DESCRIPTION="Support for reading and writing YAML-encoded data via Jackson abstractions"
-HOMEPAGE="https://github.com/FasterXML/jackson-dataformats-text"
-SRC_URI="https://github.com/FasterXML/jackson-dataformats-text/archive/jackson-dataformats-text-${PV}.tar.gz"
-
-LICENSE="Apache-2.0"
-SLOT="0"
-KEYWORDS="amd64 ~arm arm64 ppc64 x86"
-
-# Common dependencies
-# POM: pom.xml
-# com.fasterxml.jackson.core:jackson-core:2.13.3 -> >=dev-java/jackson-core-2.13.3:0
-# com.fasterxml.jackson.core:jackson-databind:2.13.3 -> >=dev-java/jackson-databind-2.13.3:0
-# org.yaml:snakeyaml:1.30 -> >=dev-java/snakeyaml-1.30:0
-
-CP_DEPEND="
- ~dev-java/jackson-core-${PV}:0
- ~dev-java/jackson-databind-${PV}:0
- dev-java/snakeyaml:0
-"
-
-DEPEND="
- >=virtual/jdk-11:*
- ${CP_DEPEND}
-"
-
-RDEPEND="
- >=virtual/jre-1.8:*
- ${CP_DEPEND}"
-
-DOCS=( README.md release-notes/{CREDITS,VERSION} )
-
-S="${WORKDIR}/jackson-dataformats-text-jackson-dataformats-text-${PV}/yaml"
-
-JAVA_SRC_DIR=( "src/main/java" "src/moditect" )
-JAVA_RESOURCE_DIRS="src/main/resources"
-
-JAVA_TEST_GENTOO_CLASSPATH="junit-4"
-JAVA_TEST_SRC_DIR="src/test/java"
-JAVA_TEST_RESOURCE_DIRS="src/test/resources"
-JAVA_TEST_EXCLUDES=(
- # Upstream's usual exclude pattern: "**/failing**/*.java"
- com.fasterxml.jackson.dataformat.yaml.failing.ObjectIdWithTree2Test
- com.fasterxml.jackson.dataformat.yaml.failing.PolymorphicWithObjectId25Test
- com.fasterxml.jackson.dataformat.yaml.failing.SimpleGeneration215Test
-)
-
-src_prepare() {
- default
- java-pkg-2_src_prepare
-
- sed -e 's:@package@:com.fasterxml.jackson.dataformat.yaml:g' \
- -e "s:@projectversion@:${PV}:g" \
- -e 's:@projectgroupid@:com.fasterxml.jackson.dataformat:g' \
- -e "s:@projectartifactid@:${PN}:g" \
- "${JAVA_SRC_DIR}/com/fasterxml/jackson/dataformat/yaml/PackageVersion.java.in" \
- > "${JAVA_SRC_DIR}/com/fasterxml/jackson/dataformat/yaml/PackageVersion.java" || die
-
- # dev-java/snakeyaml-1.30 does not provide module-info
- sed -e '/snakeyaml;/d' -i src/moditect/module-info.java || die
-}
-
-src_install() {
- default # https://bugs.gentoo.org/789582
- java-pkg-simple_src_install
-}
diff --git a/dev-java/jakarta-mail-api/jakarta-mail-api-2.1.0.ebuild b/dev-java/jakarta-mail-api/jakarta-mail-api-2.1.0.ebuild
deleted file mode 100644
index 42176c20e111..000000000000
--- a/dev-java/jakarta-mail-api/jakarta-mail-api-2.1.0.ebuild
+++ /dev/null
@@ -1,81 +0,0 @@
-# Copyright 1999-2022 Gentoo Authors
-# Distributed under the terms of the GNU General Public License v2
-
-# Skeleton command:
-# java-ebuilder --generate-ebuild --workdir . --pom pom.xml --download-uri https://github.com/eclipse-ee4j/mail/archive/2.1.0.tar.gz --slot 0 --keywords "~amd64 ~arm64 ~ppc64 ~x86" --ebuild jakarta-mail-api-2.1.0.ebuild
-
-EAPI=8
-
-JAVA_PKG_IUSE="doc source test"
-MAVEN_ID="jakarta.mail:jakarta.mail-api:2.1.0"
-JAVA_TESTING_FRAMEWORKS="junit-4"
-
-inherit java-pkg-2 java-pkg-simple
-
-DESCRIPTION="Jakarta Mail API 2.1 Specification API"
-HOMEPAGE="https://eclipse-ee4j.github.io/mail/"
-SRC_URI="https://github.com/eclipse-ee4j/mail/archive/${PV}.tar.gz -> ${P}.tar.gz"
-
-LICENSE="EPL-1.0 EPL-2.0 GPL-2-with-classpath-exception"
-SLOT="0"
-KEYWORDS="amd64 ~arm arm64 ppc64 x86"
-
-# Probably caused by --module-path missing @${test_sources}
-
-# warning: [options] system modules path not set in conjunction with -source 9
-# src/test/java/module-info.java:24: error: package is empty or does not exist: jakarta.mail.event
-# exports jakarta.mail.event;
-# ^
-# src/test/java/module-info.java:29: error: cannot find symbol
-# uses jakarta.mail.Provider;
-# ^
-# symbol: class Provider
-# location: package jakarta.mail
-# src/test/java/module-info.java:30: error: cannot find symbol
-# uses jakarta.mail.util.StreamProvider;
-# ^
-# symbol: class StreamProvider
-# location: package jakarta.mail.util
-# src/test/java/module-info.java:32: error: cannot find symbol
-# provides jakarta.mail.util.StreamProvider with jakarta.mail.util.DummyStreamProvider;
-# ^
-# symbol: class StreamProvider
-# location: package jakarta.mail.util
-# 4 errors
-RESTRICT="test"
-
-# Common dependencies
-# POM: pom.xml
-# jakarta.activation:jakarta.activation-api:2.1.0 -> >=dev-java/jakarta-activation-api-2.1.0:2.1
-
-CP_DEPEND=">=dev-java/jakarta-activation-api-2.1.0:2"
-
-DEPEND="${CP_DEPEND}
- >=virtual/jdk-11:*
- test? (
- dev-java/angus-activation:0
- )"
-
-RDEPEND="${CP_DEPEND}
- >=virtual/jre-1.8:*"
-
-DOCS=( ../{CONTRIBUTING,NOTICE,README}.md )
-
-S="${WORKDIR}/mail-${PV}/api"
-
-JAVA_SRC_DIR="src/main/"
-
-JAVA_TEST_GENTOO_CLASSPATH="junit-4,angus-activation"
-JAVA_TEST_SRC_DIR="src/test/java"
-JAVA_TEST_RESOURCE_DIRS="src/test/resources"
-
-src_prepare() {
- default
- java-pkg_clean ..
- java-pkg-2_src_prepare
-}
-
-src_install() {
- default # https://bugs.gentoo.org/789582
- java-pkg-simple_src_install
-}
diff --git a/dev-java/joda-convert/joda-convert-2.2.2-r1.ebuild b/dev-java/joda-convert/joda-convert-2.2.2-r1.ebuild
deleted file mode 100644
index df8f686daa93..000000000000
--- a/dev-java/joda-convert/joda-convert-2.2.2-r1.ebuild
+++ /dev/null
@@ -1,71 +0,0 @@
-# Copyright 1999-2022 Gentoo Authors
-# Distributed under the terms of the GNU General Public License v2
-
-# Skeleton command:
-# java-ebuilder --generate-ebuild --workdir . --pom pom.xml --download-uri https://github.com/JodaOrg/joda-convert/archive/refs/tags/v2.2.2.tar.gz --slot 0 --keywords "~amd64 ~arm ~arm64 ~ppc64 ~x86" --ebuild joda-convert-2.2.2.ebuild
-
-EAPI=8
-
-JAVA_PKG_IUSE="doc source test"
-MAVEN_ID="org.joda:joda-convert:2.2.2"
-JAVA_TESTING_FRAMEWORKS="junit-4"
-
-inherit java-pkg-2 java-pkg-simple
-
-DESCRIPTION="Library to convert Objects to and from String"
-HOMEPAGE="https://www.joda.org/joda-convert/"
-SRC_URI="https://github.com/JodaOrg/${PN}/archive/v${PV}.tar.gz -> ${P}.tar.gz"
-
-LICENSE="Apache-2.0"
-SLOT="0"
-KEYWORDS="amd64 ~arm arm64 ppc64 x86"
-
-# Compile dependencies
-# POM: pom.xml
-# test? com.google.guava:guava:31.0.1-jre -> !!!suitable-mavenVersion-not-found!!!
-# test? junit:junit:4.13.2 -> >=dev-java/junit-4.13.2:4
-
-DEPEND="
- >=virtual/jdk-1.8:*
- test? (
- dev-java/guava:0
- )
-"
-
-RDEPEND="
- >=virtual/jre-1.8:*
-"
-
-DOCS=( {LICENSE,NOTICE,RELEASE-NOTES}.txt README.md )
-
-S="${WORKDIR}/${P}"
-
-JAVA_SRC_DIR="src/main/java"
-# JAVA_RESOURCE_DIRS=""
-
-JAVA_TEST_GENTOO_CLASSPATH="guava,junit-4"
-JAVA_TEST_SRC_DIR="src/test/java"
-JAVA_TEST_RESOURCE_DIRS="src/test/resources"
-
-JAVA_TEST_EXCLUDES=(
- # Upstream: Tests run: 186, Failures: 0, Errors: 0, Skipped: 0
- # All following: No runnable methods
- org.joda.convert.test1.Test1Class
- org.joda.convert.test1.Test1Interface
- org.joda.convert.test2.Test2Class
- org.joda.convert.test2.Test2Factory
- org.joda.convert.test2.Test2Interface
- org.joda.convert.test3.Test3Class
- org.joda.convert.test3.Test3Factory
- org.joda.convert.test3.Test3Interface
- org.joda.convert.test3.Test3SuperClass
- org.joda.convert.test4.Test4Class
- org.joda.convert.test4.Test4Factory
- org.joda.convert.test4.Test4Interface
- org.joda.convert.TestRenameHandlerBadInit
-)
-
-src_install() {
- default # https://bugs.gentoo.org/789582
- java-pkg-simple_src_install
-}
diff --git a/dev-java/joda-time/Manifest b/dev-java/joda-time/Manifest
index ca62ba31e7a1..c81931d3700b 100644
--- a/dev-java/joda-time/Manifest
+++ b/dev-java/joda-time/Manifest
@@ -1,2 +1 @@
-DIST joda-time-2.10.10.tar.gz 1052384 BLAKE2B 656efddf6b98f10ce6729c6fa4c76ddfeb86dd94971c2637af3ddcb8a3a47f83948dbd58b04a6249445ef2857c5c5edb994a6d56349ed4ff4130ce9aaebd57e9 SHA512 e7917fd28cd10d7fbee02016b1f13a15a80af099b952cc0e8978bfc7fa389109553804670492c206f2b49bcf910ea093fc1838cb45ce4b7a3a885aac2aaf5943
DIST joda-time-2.10.14.tar.gz 1055876 BLAKE2B c70ad0724ad5e6d6f6a158ed05eb9711095cd353bf72a43a3edaa8ce36db1f92e0c18cd2e2b73c34e4126962d0ef97bf83844f9de924df8aadce7d38ffdb7975 SHA512 061c341c35f5187422fe402500384f5933c1eb0c77963f65b5295b8f9b479adf29f944269173d9a93e4a288c583777b21f085afe4c5da6c695f14801636f0fc1
diff --git a/dev-java/joda-time/joda-time-2.10.10-r1.ebuild b/dev-java/joda-time/joda-time-2.10.10-r1.ebuild
deleted file mode 100644
index 408ed0ec0688..000000000000
--- a/dev-java/joda-time/joda-time-2.10.10-r1.ebuild
+++ /dev/null
@@ -1,75 +0,0 @@
-# Copyright 1999-2021 Gentoo Authors
-# Distributed under the terms of the GNU General Public License v2
-
-# Skeleton command:
-# java-ebuilder --generate-ebuild --workdir . --pom joda-time-2.10.10/pom.xml --download-uri https://github.com/JodaOrg/joda-time/archive/refs/tags/v2.10.10.tar.gz --slot 0 --keywords "~amd64 ~ppc64 ~x86 ~amd64-linux ~x86-linux ~ppc-macos ~sparc-solaris ~x86-solaris" --ebuild joda-time-2.10.10.ebuild
-
-EAPI=7
-
-JAVA_PKG_IUSE="doc source test"
-MAVEN_ID="joda-time:joda-time:2.10.10"
-JAVA_TESTING_FRAMEWORKS="junit"
-
-inherit java-pkg-2 java-pkg-simple
-
-DESCRIPTION="Date and time library to replace JDK date handling"
-HOMEPAGE="https://www.joda.org/joda-time/"
-SRC_URI="https://github.com/JodaOrg/${PN}/archive/refs/tags/v${PV}.tar.gz -> ${P}.tar.gz"
-
-LICENSE="Apache-2.0"
-SLOT="0"
-KEYWORDS="amd64 ~arm arm64 ppc64 x86 ~amd64-linux ~x86-linux ~ppc-macos ~sparc-solaris ~x86-solaris"
-
-# Common dependencies
-# POM: ${P}/pom.xml
-# org.joda:joda-convert:1.9.2 -> >=dev-java/joda-convert-2.2.1:0
-
-CDEPEND="
- dev-java/joda-convert:0
-"
-
-DEPEND="
- >=virtual/jdk-1.8:*
- ${CDEPEND}
-"
-
-RDEPEND="
- >=virtual/jre-1.8:*
- ${CDEPEND}"
-
-S="${WORKDIR}"
-
-JAVA_GENTOO_CLASSPATH="joda-convert"
-JAVA_SRC_DIR="${P}/src/main/java"
-JAVA_RESOURCE_DIRS=(
- "${P}/src/main/java"
-)
-
-JAVA_TEST_GENTOO_CLASSPATH="junit"
-JAVA_TEST_SRC_DIR="${P}/src/test/java"
-JAVA_TEST_RESOURCE_DIRS=(
- "${P}/src/test/resources"
-)
-
-src_compile() {
- java-pkg-simple_src_compile
-
- # Generate the missing "org/joda/time/tz/data/ZoneInfoMap"
- # Arguments from https://github.com/JodaOrg/joda-time/blob/v2.10.10/pom.xml#L413-L427
- "$(java-config -J)" \
- -cp ${PN}.jar \
- org.joda.time.tz.ZoneInfoCompiler \
- -src "${JAVA_SRC_DIR}/org/joda/time/tz/src" \
- -dst "${P}/src/main/resources/org/joda/time/tz/data" \
- africa \
- antarctica \
- asia \
- australasia \
- europe \
- northamerica \
- southamerica \
- etcetera \
- backward
-
- java-pkg_addres ${PN}.jar "${P}"/src/main/resources || die
-}
diff --git a/dev-java/mill-bin/mill-bin-0.10.5.ebuild b/dev-java/mill-bin/mill-bin-0.10.5.ebuild
index e8485c57dfd6..4b4375e44bc5 100644
--- a/dev-java/mill-bin/mill-bin-0.10.5.ebuild
+++ b/dev-java/mill-bin/mill-bin-0.10.5.ebuild
@@ -8,7 +8,7 @@ MY_PN=${PN%-bin}
DESCRIPTION="A Java/Scala build tool"
HOMEPAGE="https://com-lihaoyi.github.io/mill/"
SRC_URI="https://github.com/com-lihaoyi/${MY_PN}/releases/download/${PV}/${PV}-assembly -> ${P}"
-KEYWORDS="~amd64 ~x86"
+KEYWORDS="amd64 x86"
LICENSE="MIT"
SLOT="0"
diff --git a/dev-java/plexus-classworlds/Manifest b/dev-java/plexus-classworlds/Manifest
index 78a8b35b095b..2136c99da805 100644
--- a/dev-java/plexus-classworlds/Manifest
+++ b/dev-java/plexus-classworlds/Manifest
@@ -1,2 +1 @@
-DIST plexus-classworlds-2.2.3.tar.bz2 41744 BLAKE2B 41ddc64c066bdfb5f2398773790b9fec213070d3dad5e57f7b0643f4347386d5304c435cd60e5b1fad32f2d7fae7b48a2afd0189d115018ed5ee38901c80867a SHA512 d5f3d3dac4df569b91ddea9265b14a2459b0ecd4ac3e4547cbac341f50d18238071a7a560d9771a9f8724c59225ea7fa8645ed72c5a00a684519a46a024c3c61
DIST plexus-classworlds-2.6.0.tar.gz 57221 BLAKE2B 7cef274981101eab85247c1a19420ebbb626b671312579ea665fc3d82e9eb8caba55955ccbc38ccd54e19c55ec1683b6a99a2cd96b08bf7ace57355a8e958d1f SHA512 d6ef17a4651da99975bcfc04f89ba128d891efc9047dc9b8afa52bd092d07268d44a7424a3a3700209bb56452f035ac1071c58ae6dc961b7e991efee1c0e117e
diff --git a/dev-java/plexus-classworlds/plexus-classworlds-2.2.3.ebuild b/dev-java/plexus-classworlds/plexus-classworlds-2.2.3.ebuild
deleted file mode 100644
index 31491d6dd752..000000000000
--- a/dev-java/plexus-classworlds/plexus-classworlds-2.2.3.ebuild
+++ /dev/null
@@ -1,41 +0,0 @@
-# Copyright 1999-2022 Gentoo Authors
-# Distributed under the terms of the GNU General Public License v2
-
-EAPI=7
-
-JAVA_PKG_IUSE="doc source test"
-WANT_ANT_TASKS="ant-junit4"
-
-inherit java-pkg-2 java-ant-2
-
-DESCRIPTION="The class loader framework of the Plexus project"
-HOMEPAGE="https://github.com/codehaus"
-SRC_URI="https://dev.gentoo.org/~ercpe/distfiles/${CATEGORY}/${PN}/${P}.tar.bz2"
-
-LICENSE="codehaus-classworlds"
-
-SLOT="0"
-KEYWORDS="amd64 ~arm arm64 ppc64 x86"
-IUSE=""
-
-DEPEND=">=virtual/jdk-1.8"
-RDEPEND=">=virtual/jre-1.8"
-
-JAVA_ANT_REWRITE_CLASSPATH="true"
-
-src_prepare() {
- cp "${FILESDIR}"/${PV}-build.xml "${S}"/build.xml || die
-
- default
-}
-
-src_install() {
- java-pkg_newjar "${S}/target/${P}.jar" "${PN}.jar"
-
- use source && java-pkg_dosrc "${S}"/src/main/java/*
- use doc && java-pkg_dojavadoc "${S}"/target/site/apidocs
-}
-
-src_test() {
- java-pkg-2_src_test
-}
diff --git a/dev-java/snakeyaml/snakeyaml-1.30.ebuild b/dev-java/snakeyaml/snakeyaml-1.30.ebuild
deleted file mode 100644
index 9ec4118119dc..000000000000
--- a/dev-java/snakeyaml/snakeyaml-1.30.ebuild
+++ /dev/null
@@ -1,95 +0,0 @@
-# Copyright 1999-2022 Gentoo Authors
-# Distributed under the terms of the GNU General Public License v2
-
-# Skeleton command:
-# java-ebuilder --generate-ebuild --workdir . --pom pom.xml --download-uri https://bitbucket.org/snakeyaml/snakeyaml/get/snakeyaml-1.30.tar.gz --slot 0 --keywords "~amd64 ~arm ~arm64 ~ppc64 ~x86" --ebuild snakeyaml-1.30.ebuild
-
-EAPI=8
-
-JAVA_PKG_IUSE="doc source test"
-MAVEN_ID="org.yaml:snakeyaml:1.30"
-JAVA_TESTING_FRAMEWORKS="junit-4"
-
-inherit java-pkg-2 java-pkg-simple
-
-DESCRIPTION="YAML 1.1 parser and emitter for Java"
-HOMEPAGE="https://bitbucket.org/snakeyaml/snakeyaml"
-SRC_URI="https://bitbucket.org/${PN}/${PN}/get/${P}.tar.gz"
-
-LICENSE="Apache-2.0"
-SLOT="0"
-KEYWORDS="amd64 ~arm arm64 ppc64 x86"
-
-# Compile dependencies
-# POM: pom.xml
-# test? joda-time:joda-time:2.10.1 -> >=dev-java/joda-time-2.10.10:0
-# test? junit:junit:4.13.1 -> >=dev-java/junit-4.13.2:4
-# test? org.apache.velocity:velocity:1.6.2 -> !!!artifactId-not-found!!!
-
-DEPEND="
- >=virtual/jdk-1.8:*
- test? (
- dev-java/velocity:0
- dev-java/joda-time:0
- )
-"
-
-RDEPEND="
- >=virtual/jre-1.8:*
-"
-
-# https://bitbucket.org/snakeyaml/snakeyaml/pull-requests/7
-PATCHES=( "${FILESDIR}/snakeyaml-1.30-fix-test-check.patch" )
-DOCS=( README.md )
-
-S="${WORKDIR}/snakeyaml-snakeyaml-49227c24d741/"
-
-JAVA_SRC_DIR="src/main/java"
-
-JAVA_TEST_GENTOO_CLASSPATH="joda-time,junit-4,velocity"
-JAVA_TEST_SRC_DIR="src/test/java"
-JAVA_TEST_RESOURCE_DIRS="src/test/resources"
-
-src_prepare() {
- default
- java-utils-2_src_prepare
-}
-
-src_test() {
- export EnvironmentKey1="EnvironmentValue1"
- export EnvironmentEmpty=""
-
- # There were 2 failures:
- # 1) yamlClassInYAMLCL(org.yaml.snakeyaml.issues.issue318.ContextClassLoaderTest)
- # java.lang.ClassNotFoundException: org.yaml.snakeyaml.Yaml
- # at java.base/java.net.URLClassLoader.findClass(URLClassLoader.java:476)
- # at java.base/java.lang.ClassLoader.loadClass(ClassLoader.java:589)
- # at java.base/java.lang.ClassLoader.loadClass(ClassLoader.java:522)
- # at org.yaml.snakeyaml.issues.issue318.ContextClassLoaderTest.yamlClassInYAMLCL(ContextClassLoaderTest.java:127)
- # 2) domainInDifferentConstructor(org.yaml.snakeyaml.issues.issue318.ContextClassLoaderTest)
- # java.lang.ClassNotFoundException: org.yaml.snakeyaml.Yaml
- # at java.base/java.net.URLClassLoader.findClass(URLClassLoader.java:476)
- # at java.base/java.lang.ClassLoader.loadClass(ClassLoader.java:589)
- # at java.base/java.lang.ClassLoader.loadClass(ClassLoader.java:522)
- # at org.yaml.snakeyaml.issues.issue318.ContextClassLoaderTest.domainInDifferentConstructor(ContextClassLoaderTest.java:135)
-
- pushd src/test/java || die
- local JAVA_TEST_RUN_ONLY=$(find * -name "*Test.java" \
- ! -name "StressTest.java" \
- ! -name "ParallelTest.java" \
- ! -name "AbstractTest.java" \
- ! -name "PyImportTest.java" \
- ! -name "ContextClassLoaderTest.java" \
- )
- popd
-
- JAVA_TEST_RUN_ONLY="${JAVA_TEST_RUN_ONLY//.java}"
- JAVA_TEST_RUN_ONLY="${JAVA_TEST_RUN_ONLY//\//.}"
-
- java-pkg-simple_src_test
-}
-
-src_install() {
- default # https://bugs.gentoo.org/789582
- java-pkg-simple_src_install
-}